{"text_format":"3","workbook":"xlsx","n_sheets":3,"sheets":["1","2","3"],"not_rendered":{"images":2,"defined_names":4},"read":"whole","date_system":"1900"}

{"sheet":"1","index":0,"n_rows":45,"n_cols":27,"rows_kept":45,"merged":[[0,0,6,7],[0,10,0,16],[0,18,0,24],[8,0,8,1],[8,2,8,3],[8,4,8,5],[8,6,8,7],[8,8,8,9],[8,10,8,17],[8,18,8,25],[9,10,9,11],[9,12,9,17],[9,18,9,19],[9,20,9,25],[10,0,10,1],[10,2,10,3],[10,4,10,5],[10,6,10,7],[10,8,10,9],[10,10,10,17],[10,18,10,25],[11,0,11,1],[11,2,11,3],[11,4,11,5],[11,6,11,7],[11,8,11,9],[11,10,11,17],[11,18,11,25],[12,0,12,1],[12,2,12,3],[12,4,12,5],[12,6,12,7],[12,8,12,9],[12,10,12,17],[12,18,12,25],[13,0,13,1],[13,2,13,3],[13,4,13,5],[13,6,13,7],[13,8,13,9],[13,10,13,17],[13,18,13,25],[14,0,14,1],[14,2,14,3],[14,4,14,5],[14,6,14,7],[14,8,14,9],[14,10,14,17],[14,18,14,25],[15,10,15,11],[15,12,15,17],[15,18,15,19],[15,20,15,25],[16,0,16,1],[16,2,16,3],[16,4,16,5],[16,6,16,7],[16,8,16,9],[16,10,16,17],[16,18,16,25],[17,0,17,1],[17,2,17,3],[17,4,17,5],[17,6,17,7],[17,8,17,9],[17,10,17,17],[17,18,17,25],[18,0,18,1],[18,2,18,3],[18,4,18,5],[18,6,18,7],[18,8,18,9],[18,10,18,17],[18,18,18,25],[19,0,19,1],[19,2,19,3],[19,4,19,5],[19,6,19,7],[19,8,19,9],[19,10,19,17],[19,18,19,25],[20,0,20,1],[20,2,20,3],[20,4,20,5],[20,6,20,7],[20,8,20,9],[20,10,20,17],[20,18,20,25],[21,10,21,11],[21,12,21,17],[21,18,21,19],[21,20,21,25],[22,0,22,1],[22,2,22,3],[22,4,22,5],[22,6,22,7],[22,8,22,9],[22,10,22,17],[22,18,22,25],[23,0,23,1],[23,2,23,3],[23,4,23,5],[23,6,23,7],[23,8,23,9],[23,10,23,17],[23,18,23,25],[24,0,24,1],[24,2,24,3],[24,4,24,5],[24,6,24,7],[24,8,24,9],[24,10,24,17],[24,18,24,25],[25,0,25,1],[25,2,25,3],[25,4,25,5],[25,6,25,7],[25,8,25,9],[25,10,25,17],[25,18,25,25],[26,0,26,1],[26,2,26,3],[26,4,26,5],[26,6,26,7],[26,8,26,9],[26,10,26,17],[26,18,26,25],[27,10,27,11],[27,12,27,17],[27,18,27,19],[27,20,27,25],[28,0,28,1],[28,2,28,3],[28,4,28,5],[28,6,28,7],[28,8,28,9],[28,10,28,17],[28,18,28,25],[29,0,29,1],[29,2,29,3],[29,4,29,5],[29,6,29,7],[29,8,29,9],[29,10,29,17],[29,18,29,25],[30,0,30,1],[30,2,30,3],[30,4,30,5],[30,6,30,7],[30,8,30,9],[30,10,30,17],[30,18,30,25],[31,0,31,1],[31,2,31,3],[31,4,31,5],[31,6,31,7],[31,8,31,9],[31,10,31,17],[31,18,31,25],[32,0,32,1],[32,2,32,3],[32,4,32,5],[32,6,32,7],[32,8,32,9],[32,10,32,17],[32,18,32,25],[33,10,33,11],[33,12,33,17],[33,18,33,19],[33,20,33,25],[34,0,34,1],[34,2,34,3],[34,4,34,5],[34,6,34,7],[34,8,34,9],[34,10,34,17],[34,18,34,25],[35,0,35,1],[35,2,35,3],[35,4,35,5],[35,6,35,7],[35,8,35,9],[35,10,35,17],[35,18,35,25],[36,0,36,1],[36,2,36,3],[36,4,36,5],[36,6,36,7],[36,8,36,9],[36,10,36,17],[36,18,36,25],[37,0,37,1],[37,2,37,3],[37,4,37,5],[37,6,37,7],[37,8,37,9],[37,10,37,17],[37,18,37,25],[38,0,38,1],[38,2,38,3],[38,4,38,5],[38,6,38,7],[38,8,38,9],[38,10,38,17],[38,18,38,25],[40,0,40,1],[40,2,40,3],[41,0,41,1],[41,2,41,3],[42,0,42,1],[42,2,42,3],[43,0,43,1],[43,2,43,3],[43,10,43,25],[44,0,44,1],[44,2,44,3],[44,10,44,25]]}
[{"$f":"DATE(AA18,AA20,1)","v":"2022-08-01"},{"$nulls":9},{"$f":"DATE(YEAR(A1),MONTH(A1)-1,1)","v":"2022-07-01"},{"$nulls":7},{"$f":"DATE(YEAR(A1),MONTH(A1)+1,1)","v":"2022-09-01"}]
[{"$nulls":10},{"$f":"INDEX({\"S\";\"M\";\"T\";\"W\";\"T\";\"F\";\"S\"},1+MOD(start_day+1-2,7))","v":"S"},{"$f":"INDEX({\"S\";\"M\";\"T\";\"W\";\"T\";\"F\";\"S\"},1+MOD(start_day+2-2,7))","v":"M"},{"$f":"INDEX({\"S\";\"M\";\"T\";\"W\";\"T\";\"F\";\"S\"},1+MOD(start_day+3-2,7))","v":"T"},{"$f":"INDEX({\"S\";\"M\";\"T\";\"W\";\"T\";\"F\";\"S\"},1+MOD(start_day+4-2,7))","v":"W"},{"$f":"INDEX({\"S\";\"M\";\"T\";\"W\";\"T\";\"F\";\"S\"},1+MOD(start_day+5-2,7))","v":"T"},{"$f":"INDEX({\"S\";\"M\";\"T\";\"W\";\"T\";\"F\";\"S\"},1+MOD(start_day+6-2,7))","v":"F"},{"$f":"INDEX({\"S\";\"M\";\"T\";\"W\";\"T\";\"F\";\"S\"},1+MOD(start_day+7-2,7))","v":"S"},null,{"$f":"INDEX({\"S\";\"M\";\"T\";\"W\";\"T\";\"F\";\"S\"},1+MOD(start_day+1-2,7))","v":"S"},{"$f":"INDEX({\"S\";\"M\";\"T\";\"W\";\"T\";\"F\";\"S\"},1+MOD(start_day+2-2,7))","v":"M"},{"$f":"INDEX({\"S\";\"M\";\"T\";\"W\";\"T\";\"F\";\"S\"},1+MOD(start_day+3-2,7))","v":"T"},{"$f":"INDEX({\"S\";\"M\";\"T\";\"W\";\"T\";\"F\";\"S\"},1+MOD(start_day+4-2,7))","v":"W"},{"$f":"INDEX({\"S\";\"M\";\"T\";\"W\";\"T\";\"F\";\"S\"},1+MOD(start_day+5-2,7))","v":"T"},{"$f":"INDEX({\"S\";\"M\";\"T\";\"W\";\"T\";\"F\";\"S\"},1+MOD(start_day+6-2,7))","v":"F"},{"$f":"INDEX({\"S\";\"M\";\"T\";\"W\";\"T\";\"F\";\"S\"},1+MOD(start_day+7-2,7))","v":"S"}]
[{"$nulls":10},{"$f":"IF(MONTH($K$1)<>MONTH($K$1-(WEEKDAY($K$1,1)-(start_day-1))-IF((WEEKDAY($K$1,1)-(start_day-1))<=0,7,0)+(ROW(K3)-ROW($K$3))*7+(COLUMN(K3)-COLUMN($K$3)+1)),\"\",$K$1-(WEEKDAY($K$1,1)-(start_day-1))-IF((WEEKDAY($K$1,1)-(start_day-1))<=0,7,0)+(ROW(K3)-ROW($K$3))*7+(COLUMN(K3)-COLUMN($K$3)+1))","v":"2022-07-10"},"2022-07-11","2022-07-12","2022-07-13","2022-07-14","2022-07-15","2022-07-16",null,{"$f":"IF(MONTH($S$1)<>MONTH($S$1-(WEEKDAY($S$1,1)-(start_day-1))-IF((WEEKDAY($S$1,1)-(start_day-1))<=0,7,0)+(ROW(S3)-ROW($S$3))*7+(COLUMN(S3)-COLUMN($S$3)+1)),\"\",$S$1-(WEEKDAY($S$1,1)-(start_day-1))-IF((WEEKDAY($S$1,1)-(start_day-1))<=0,7,0)+(ROW(S3)-ROW($S$3))*7+(COLUMN(S3)-COLUMN($S$3)+1))","v":"2022-09-11"},"2022-09-12","2022-09-13","2022-09-14","2022-09-15","2022-09-16","2022-09-17"]
[{"$nulls":10},"2022-07-17","2022-07-18","2022-07-19","2022-07-20","2022-07-21","2022-07-22","2022-07-23",null,"2022-09-18","2022-09-19","2022-09-20","2022-09-21","2022-09-22","2022-09-23","2022-09-24"]
[{"$nulls":10},"2022-07-24","2022-07-25","2022-07-26","2022-07-27","2022-07-28","2022-07-29","2022-07-30",null,"2022-09-25","2022-09-26","2022-09-27","2022-09-28","2022-09-29","2022-09-30",""]
[{"$nulls":10},"2022-07-31","","","","","","",null,"","","","","","",""]
[{"$nulls":10},"","","","","","","",null,"","","","","","",""]
[{"$nulls":10},"","","","","","","",null,"","","","","","",""]
[{"$f":"A10","v":"2022-08-14"},null,{"$f":"C10","v":"2022-08-15"},null,{"$f":"E10","v":"2022-08-16"},null,{"$f":"G10","v":"2022-08-17"},null,{"$f":"I10","v":"2022-08-18"},null,{"$f":"K10","v":"2022-08-19"},{"$nulls":7},{"$f":"S10","v":"2022-08-20"}]
[{"$f":"$A$1-(WEEKDAY($A$1,1)-(start_day-1))-IF((WEEKDAY($A$1,1)-(start_day-1))<=0,7,0)+1","v":"2022-08-14"},null,{"$f":"A10+1","v":"2022-08-15"},null,{"$f":"C10+1","v":"2022-08-16"},null,{"$f":"E10+1","v":"2022-08-17"},null,{"$f":"G10+1","v":"2022-08-18"},null,{"$f":"I10+1","v":"2022-08-19"},{"$nulls":7},{"$f":"K10+1","v":"2022-08-20"}]
[]
[]
[]
[]
[]
[{"$f":"S10+1","v":"2022-08-21"},null,{"$f":"A16+1","v":"2022-08-22"},"1st Day of Practice",{"$f":"C16+1","v":"2022-08-23"},"Practice",{"$f":"E16+1","v":"2022-08-24"},"Practice",{"$f":"G16+1","v":"2022-08-25"},"Practice",{"$f":"I16+1","v":"2022-08-26"},null,"NO PRACTICE ON ",{"$nulls":5},{"$f":"K16+1","v":"2022-08-27"}]
[null,null,"After School on Track",{"$nulls":7},"FRIDAYS"]
[null,null,"3:50 PM - 5:00 PM",null,"3:50 - 5:00 PM",null,"3:50 - 5:00 PM",null,"3:50 - 5:00 PM",{"$nulls":17},2022]
[]
[{"$nulls":26},8]
[]
[{"$f":"S16+1","v":"2022-08-28"},null,{"$f":"A22+1","v":"2022-08-29"},null,{"$f":"C22+1","v":"2022-08-30"},null,{"$f":"E22+1","v":"2022-08-31"},null,{"$f":"G22+1","v":"2022-09-01"},"SEPTEMBER --",{"$f":"I22+1","v":"2022-09-02"},null,"SEPTEMBER --",{"$nulls":5},{"$f":"K22+1","v":"2022-09-03"}]
[null,null,"PRACTICE",null,"PRACTICE",null,"PRACTICE",null,"PRACTICE",null,"NO PRACTICE"]
[{"$nulls":26},22]
[null,null,"3:50 - 5:00 pm",null,"3:50 - 5:00 PM",null,"3:50 - 5:00 PM",null,"3:50 - 5:00 PM"]
[]
[]
[{"$f":"S22+1","v":"2022-09-04"},null,{"$f":"A28+1","v":"2022-09-05"},null,{"$f":"C28+1","v":"2022-09-06"},null,{"$f":"E28+1","v":"2022-09-07"},null,{"$f":"G28+1","v":"2022-09-08"},null,{"$f":"I28+1","v":"2022-09-09"},{"$nulls":7},{"$f":"K28+1","v":"2022-09-10"}]
[null,null,"HOLIDAY",null,"PRACTICE",null,"PRACTICE",null,"PRACTICE",null,"NO PRACTICE"]
[]
[null,null,"NO PRACTICE",null,"3:50 - 5:00 PM",null,"3:50 - 5:00 PM",null,"3:50 - 5:00 PM"]
[]
[]
[{"$f":"S28+1","v":"2022-09-11"},null,{"$f":"A34+1","v":"2022-09-12"},null,{"$f":"C34+1","v":"2022-09-13"},null,{"$f":"E34+1","v":"2022-09-14"},null,{"$f":"G34+1","v":"2022-09-15"},null,{"$f":"I34+1","v":"2022-09-16"},{"$nulls":7},{"$f":"K34+1","v":"2022-09-17"}]
[null,null,"PRACTICE",null,"PRACTICE",null,"** MORNING PRACTICE",null,"** MORNING PRACTICE",{"$nulls":9},"1ST XC MEET"]
[{"$nulls":10},"NO PRACTICE",{"$nulls":7},"JUDSON ISD MEET AT "]
[null,null,"3:50 - 5:00 PM",null,"3:50 - 5:00 PM",null,"7:00 AM - 8:00 AM",null,"7:00 AM - 8:00 AM",{"$nulls":9},"NORTH EAST SPORTS PARK"]
[{"$nulls":18},"GIRLS: 9:30 AM"]
[{"$nulls":18},"BOYS: 10:00 AM"]
[{"$f":"S34+1","v":"2022-09-18"},null,{"$f":"A40+1","v":"2022-09-19"},null,"Notes"]
[null,null,"PRACTICE"]
[]
[null,null,"3:50 - 5:00 PM"]
[{"$nulls":10},"Calendar Templates by Vertex42"]
[{"$nulls":10},"https://www.vertex42.com/calendars/"]

{"sheet":"2","index":1,"n_rows":45,"n_cols":25,"rows_kept":45,"merged":[[0,0,6,7],[0,10,0,16],[0,18,0,24],[8,0,8,1],[8,2,8,3],[8,4,8,5],[8,6,8,7],[8,8,8,9],[8,10,8,17],[8,18,8,25],[9,10,9,11],[9,12,9,17],[9,18,9,19],[9,20,9,25],[10,0,10,1],[10,2,10,3],[10,4,10,5],[10,6,10,7],[10,8,10,9],[10,10,10,17],[10,18,10,25],[11,0,11,1],[11,2,11,3],[11,4,11,5],[11,6,11,7],[11,8,11,9],[11,10,11,17],[11,18,11,25],[12,0,12,1],[12,2,12,3],[12,4,12,5],[12,6,12,7],[12,8,12,9],[12,10,12,17],[12,18,12,25],[13,0,13,1],[13,2,13,3],[13,4,13,5],[13,6,13,7],[13,8,13,9],[13,10,13,17],[13,18,13,25],[14,0,14,1],[14,2,14,3],[14,4,14,5],[14,6,14,7],[14,8,14,9],[14,10,14,17],[14,18,14,25],[15,10,15,11],[15,12,15,17],[15,18,15,19],[15,20,15,25],[16,0,16,1],[16,2,16,3],[16,4,16,5],[16,6,16,7],[16,8,16,9],[16,10,16,17],[16,18,16,25],[17,0,17,1],[17,2,17,3],[17,4,17,5],[17,6,17,7],[17,8,17,9],[17,10,17,17],[17,18,17,25],[18,0,18,1],[18,2,18,3],[18,4,18,5],[18,6,18,7],[18,8,18,9],[18,10,18,17],[18,18,18,25],[19,0,19,1],[19,2,19,3],[19,4,19,5],[19,6,19,7],[19,8,19,9],[19,10,19,17],[19,18,19,25],[20,0,20,1],[20,2,20,3],[20,4,20,5],[20,6,20,7],[20,8,20,9],[20,10,20,17],[20,18,20,25],[21,10,21,11],[21,12,21,17],[21,18,21,19],[21,20,21,25],[22,0,22,1],[22,2,22,3],[22,4,22,5],[22,6,22,7],[22,8,22,9],[22,10,22,17],[22,18,22,25],[23,0,23,1],[23,2,23,3],[23,4,23,5],[23,6,23,7],[23,8,23,9],[23,10,23,17],[23,18,23,25],[24,0,24,1],[24,2,24,3],[24,4,24,5],[24,6,24,7],[24,8,24,9],[24,10,24,17],[24,18,24,25],[25,0,25,1],[25,2,25,3],[25,4,25,5],[25,6,25,7],[25,8,25,9],[25,10,25,17],[25,18,25,25],[26,0,26,1],[26,2,26,3],[26,4,26,5],[26,6,26,7],[26,8,26,9],[26,10,26,17],[26,18,26,25],[27,10,27,11],[27,12,27,17],[27,18,27,19],[27,20,27,25],[28,0,28,1],[28,2,28,3],[28,4,28,5],[28,6,28,7],[28,8,28,9],[28,10,28,17],[28,18,28,25],[29,0,29,1],[29,2,29,3],[29,4,29,5],[29,6,29,7],[29,8,29,9],[29,10,29,17],[29,18,29,25],[30,0,30,1],[30,2,30,3],[30,4,30,5],[30,6,30,7],[30,8,30,9],[30,10,30,17],[30,18,30,25],[31,0,31,1],[31,2,31,3],[31,4,31,5],[31,6,31,7],[31,8,31,9],[31,10,31,17],[31,18,31,25],[32,0,32,1],[32,2,32,3],[32,4,32,5],[32,6,32,7],[32,8,32,9],[32,10,32,17],[32,18,32,25],[33,10,33,11],[33,12,33,17],[33,18,33,19],[33,20,33,25],[34,0,34,1],[34,2,34,3],[34,4,34,5],[34,6,34,7],[34,8,34,9],[34,10,34,17],[34,18,34,25],[35,0,35,1],[35,2,35,3],[35,4,35,5],[35,6,35,7],[35,8,35,9],[35,10,35,17],[35,18,35,25],[36,0,36,1],[36,2,36,3],[36,4,36,5],[36,6,36,7],[36,8,36,9],[36,10,36,17],[36,18,36,25],[37,0,37,1],[37,2,37,3],[37,4,37,5],[37,6,37,7],[37,8,37,9],[37,10,37,17],[37,18,37,25],[38,0,38,1],[38,2,38,3],[38,4,38,5],[38,6,38,7],[38,8,38,9],[38,10,38,17],[38,18,38,25],[40,0,40,1],[40,2,40,3],[41,0,41,1],[41,2,41,3],[42,0,42,1],[42,2,42,3],[43,0,43,1],[43,2,43,3],[43,10,43,25],[44,0,44,1],[44,2,44,3],[44,10,44,25]]}
[{"$f":"DATE('1'!AA18,'1'!AA20+1,1)","v":"2022-09-01"},{"$nulls":9},{"$f":"DATE(YEAR(A1),MONTH(A1)-1,1)","v":"2022-08-01"},{"$nulls":7},{"$f":"DATE(YEAR(A1),MONTH(A1)+1,1)","v":"2022-10-01"}]
[{"$nulls":10},{"$f":"INDEX({\"S\";\"M\";\"T\";\"W\";\"T\";\"F\";\"S\"},1+MOD(start_day+1-2,7))","v":"S"},{"$f":"INDEX({\"S\";\"M\";\"T\";\"W\";\"T\";\"F\";\"S\"},1+MOD(start_day+2-2,7))","v":"M"},{"$f":"INDEX({\"S\";\"M\";\"T\";\"W\";\"T\";\"F\";\"S\"},1+MOD(start_day+3-2,7))","v":"T"},{"$f":"INDEX({\"S\";\"M\";\"T\";\"W\";\"T\";\"F\";\"S\"},1+MOD(start_day+4-2,7))","v":"W"},{"$f":"INDEX({\"S\";\"M\";\"T\";\"W\";\"T\";\"F\";\"S\"},1+MOD(start_day+5-2,7))","v":"T"},{"$f":"INDEX({\"S\";\"M\";\"T\";\"W\";\"T\";\"F\";\"S\"},1+MOD(start_day+6-2,7))","v":"F"},{"$f":"INDEX({\"S\";\"M\";\"T\";\"W\";\"T\";\"F\";\"S\"},1+MOD(start_day+7-2,7))","v":"S"},null,{"$f":"INDEX({\"S\";\"M\";\"T\";\"W\";\"T\";\"F\";\"S\"},1+MOD(start_day+1-2,7))","v":"S"},{"$f":"INDEX({\"S\";\"M\";\"T\";\"W\";\"T\";\"F\";\"S\"},1+MOD(start_day+2-2,7))","v":"M"},{"$f":"INDEX({\"S\";\"M\";\"T\";\"W\";\"T\";\"F\";\"S\"},1+MOD(start_day+3-2,7))","v":"T"},{"$f":"INDEX({\"S\";\"M\";\"T\";\"W\";\"T\";\"F\";\"S\"},1+MOD(start_day+4-2,7))","v":"W"},{"$f":"INDEX({\"S\";\"M\";\"T\";\"W\";\"T\";\"F\";\"S\"},1+MOD(start_day+5-2,7))","v":"T"},{"$f":"INDEX({\"S\";\"M\";\"T\";\"W\";\"T\";\"F\";\"S\"},1+MOD(start_day+6-2,7))","v":"F"},{"$f":"INDEX({\"S\";\"M\";\"T\";\"W\";\"T\";\"F\";\"S\"},1+MOD(start_day+7-2,7))","v":"S"}]
[{"$nulls":10},{"$f":"IF(MONTH($K$1)<>MONTH($K$1-(WEEKDAY($K$1,1)-(start_day-1))-IF((WEEKDAY($K$1,1)-(start_day-1))<=0,7,0)+(ROW(K3)-ROW($K$3))*7+(COLUMN(K3)-COLUMN($K$3)+1)),\"\",$K$1-(WEEKDAY($K$1,1)-(start_day-1))-IF((WEEKDAY($K$1,1)-(start_day-1))<=0,7,0)+(ROW(K3)-ROW($K$3))*7+(COLUMN(K3)-COLUMN($K$3)+1))","v":"2022-08-14"},"2022-08-15","2022-08-16","2022-08-17","2022-08-18","2022-08-19","2022-08-20",null,{"$f":"IF(MONTH($S$1)<>MONTH($S$1-(WEEKDAY($S$1,1)-(start_day-1))-IF((WEEKDAY($S$1,1)-(start_day-1))<=0,7,0)+(ROW(S3)-ROW($S$3))*7+(COLUMN(S3)-COLUMN($S$3)+1)),\"\",$S$1-(WEEKDAY($S$1,1)-(start_day-1))-IF((WEEKDAY($S$1,1)-(start_day-1))<=0,7,0)+(ROW(S3)-ROW($S$3))*7+(COLUMN(S3)-COLUMN($S$3)+1))","v":"2022-10-09"},"2022-10-10","2022-10-11","2022-10-12","2022-10-13","2022-10-14","2022-10-15"]
[{"$nulls":10},"2022-08-21","2022-08-22","2022-08-23","2022-08-24","2022-08-25","2022-08-26","2022-08-27",null,"2022-10-16","2022-10-17","2022-10-18","2022-10-19","2022-10-20","2022-10-21","2022-10-22"]
[{"$nulls":10},"2022-08-28","2022-08-29","2022-08-30","2022-08-31","","","",null,"2022-10-23","2022-10-24","2022-10-25","2022-10-26","2022-10-27","2022-10-28","2022-10-29"]
[{"$nulls":10},"","","","","","","",null,"2022-10-30","2022-10-31","","","","",""]
[{"$nulls":10},"","","","","","","",null,"","","","","","",""]
[{"$nulls":10},"","","","","","","",null,"","","","","","",""]
[{"$f":"A10","v":"2022-09-11"},null,{"$f":"C10","v":"2022-09-12"},null,{"$f":"E10","v":"2022-09-13"},null,{"$f":"G10","v":"2022-09-14"},null,{"$f":"I10","v":"2022-09-15"},null,{"$f":"K10","v":"2022-09-16"},{"$nulls":7},{"$f":"S10","v":"2022-09-17"}]
[{"$f":"$A$1-(WEEKDAY($A$1,1)-(start_day-1))-IF((WEEKDAY($A$1,1)-(start_day-1))<=0,7,0)+1","v":"2022-09-11"},null,{"$f":"A10+1","v":"2022-09-12"},null,{"$f":"C10+1","v":"2022-09-13"},null,{"$f":"E10+1","v":"2022-09-14"},null,{"$f":"G10+1","v":"2022-09-15"},null,{"$f":"I10+1","v":"2022-09-16"},{"$nulls":7},{"$f":"K10+1","v":"2022-09-17"}]
[{"$nulls":18},"JUDSON ISD MEET AT "]
[{"$nulls":6},"** MORNING PRACTICE",null,"** MORNING PRACTICE",{"$nulls":9},"NORTH EAST SPORTS PARK"]
[null,null,"3:50 - 5:00 PM",null,"3:50 - 5:00 PM",{"$nulls":5},"NO PRACTICE"]
[]
[]
[{"$f":"S10+1","v":"2022-09-18"},null,{"$f":"A16+1","v":"2022-09-19"},null,{"$f":"C16+1","v":"2022-09-20"},null,{"$f":"E16+1","v":"2022-09-21"},null,{"$f":"G16+1","v":"2022-09-22"},null,{"$f":"I16+1","v":"2022-09-23"},{"$nulls":7},{"$f":"K16+1","v":"2022-09-24"}]
[null,null,"PRACTICE",null,"PRACTICE",null,"PRACTICE",null,"PRACTICE",null,"NO PRACTICE"]
[null,null,"3:50 - 5:00 PM"]
[{"$nulls":4},"3:50 - 5:00 PM",null,"3:50 - 5:00 PM",null,"3:50 - 5:00 PM"]
[]
[]
[{"$f":"S16+1","v":"2022-09-25"},null,{"$f":"A22+1","v":"2022-09-26"},null,{"$f":"C22+1","v":"2022-09-27"},null,{"$f":"E22+1","v":"2022-09-28"},null,{"$f":"G22+1","v":"2022-09-29"},null,{"$f":"I22+1","v":"2022-09-30"},{"$nulls":7},{"$f":"K22+1","v":"2022-10-01"}]
[{"$nulls":4},"** MORNING PRACTICE",null,"PRACTICE",null,"PRACTICE"]
[null,null,"PRACTICE",{"$nulls":7},"NO PRACTICE"]
[{"$nulls":4},"7:00 AM - 8:00 AM",null,"3:50 - 5:00 PM",null,"3:50 - 5:00 PM"]
[null,null,"3:50 - 5:00 PM"]
[]
[{"$f":"S22+1","v":"2022-10-02"},null,{"$f":"A28+1","v":"2022-10-03"},null,{"$f":"C28+1","v":"2022-10-04"},null,{"$f":"E28+1","v":"2022-10-05"},null,{"$f":"G28+1","v":"2022-10-06"},null,{"$f":"I28+1","v":"2022-10-07"},{"$nulls":7},{"$f":"K28+1","v":"2022-10-08"}]
[]
[]
[]
[]
[]
[{"$f":"S28+1","v":"2022-10-09"},null,{"$f":"A34+1","v":"2022-10-10"},null,{"$f":"C34+1","v":"2022-10-11"},null,{"$f":"E34+1","v":"2022-10-12"},null,{"$f":"G34+1","v":"2022-10-13"},null,{"$f":"I34+1","v":"2022-10-14"},{"$nulls":7},{"$f":"K34+1","v":"2022-10-15"}]
[]
[]
[]
[]
[]
[{"$f":"S34+1","v":"2022-10-16"},null,{"$f":"A40+1","v":"2022-10-17"},null,"Notes"]
[]
[]
[]
[{"$nulls":10},"Calendar Templates by Vertex42"]
[{"$nulls":10},"https://www.vertex42.com/calendars/"]

{"sheet":"3","index":2,"n_rows":45,"n_cols":25,"rows_kept":45,"merged":[[0,0,6,7],[0,10,0,16],[0,18,0,24],[8,0,8,1],[8,2,8,3],[8,4,8,5],[8,6,8,7],[8,8,8,9],[8,10,8,17],[8,18,8,25],[9,10,9,11],[9,12,9,17],[9,18,9,19],[9,20,9,25],[10,0,10,1],[10,2,10,3],[10,4,10,5],[10,6,10,7],[10,8,10,9],[10,10,10,17],[10,18,10,25],[11,0,11,1],[11,2,11,3],[11,4,11,5],[11,6,11,7],[11,8,11,9],[11,10,11,17],[11,18,11,25],[12,0,12,1],[12,2,12,3],[12,4,12,5],[12,6,12,7],[12,8,12,9],[12,10,12,17],[12,18,12,25],[13,0,13,1],[13,2,13,3],[13,4,13,5],[13,6,13,7],[13,8,13,9],[13,10,13,17],[13,18,13,25],[14,0,14,1],[14,2,14,3],[14,4,14,5],[14,6,14,7],[14,8,14,9],[14,10,14,17],[14,18,14,25],[15,10,15,11],[15,12,15,17],[15,18,15,19],[15,20,15,25],[16,0,16,1],[16,2,16,3],[16,4,16,5],[16,6,16,7],[16,8,16,9],[16,10,16,17],[16,18,16,25],[17,0,17,1],[17,2,17,3],[17,4,17,5],[17,6,17,7],[17,8,17,9],[17,10,17,17],[17,18,17,25],[18,0,18,1],[18,2,18,3],[18,4,18,5],[18,6,18,7],[18,8,18,9],[18,10,18,17],[18,18,18,25],[19,0,19,1],[19,2,19,3],[19,4,19,5],[19,6,19,7],[19,8,19,9],[19,10,19,17],[19,18,19,25],[20,0,20,1],[20,2,20,3],[20,4,20,5],[20,6,20,7],[20,8,20,9],[20,10,20,17],[20,18,20,25],[21,10,21,11],[21,12,21,17],[21,18,21,19],[21,20,21,25],[22,0,22,1],[22,2,22,3],[22,4,22,5],[22,6,22,7],[22,8,22,9],[22,10,22,17],[22,18,22,25],[23,0,23,1],[23,2,23,3],[23,4,23,5],[23,6,23,7],[23,8,23,9],[23,10,23,17],[23,18,23,25],[24,0,24,1],[24,2,24,3],[24,4,24,5],[24,6,24,7],[24,8,24,9],[24,10,24,17],[24,18,24,25],[25,0,25,1],[25,2,25,3],[25,4,25,5],[25,6,25,7],[25,8,25,9],[25,10,25,17],[25,18,25,25],[26,0,26,1],[26,2,26,3],[26,4,26,5],[26,6,26,7],[26,8,26,9],[26,10,26,17],[26,18,26,25],[27,10,27,11],[27,12,27,17],[27,18,27,19],[27,20,27,25],[28,0,28,1],[28,2,28,3],[28,4,28,5],[28,6,28,7],[28,8,28,9],[28,10,28,17],[28,18,28,25],[29,0,29,1],[29,2,29,3],[29,4,29,5],[29,6,29,7],[29,8,29,9],[29,10,29,17],[29,18,29,25],[30,0,30,1],[30,2,30,3],[30,4,30,5],[30,6,30,7],[30,8,30,9],[30,10,30,17],[30,18,30,25],[31,0,31,1],[31,2,31,3],[31,4,31,5],[31,6,31,7],[31,8,31,9],[31,10,31,17],[31,18,31,25],[32,0,32,1],[32,2,32,3],[32,4,32,5],[32,6,32,7],[32,8,32,9],[32,10,32,17],[32,18,32,25],[33,10,33,11],[33,12,33,17],[33,18,33,19],[33,20,33,25],[34,0,34,1],[34,2,34,3],[34,4,34,5],[34,6,34,7],[34,8,34,9],[34,10,34,17],[34,18,34,25],[35,0,35,1],[35,2,35,3],[35,4,35,5],[35,6,35,7],[35,8,35,9],[35,10,35,17],[35,18,35,25],[36,0,36,1],[36,2,36,3],[36,4,36,5],[36,6,36,7],[36,8,36,9],[36,10,36,17],[36,18,36,25],[37,0,37,1],[37,2,37,3],[37,4,37,5],[37,6,37,7],[37,8,37,9],[37,10,37,17],[37,18,37,25],[38,0,38,1],[38,2,38,3],[38,4,38,5],[38,6,38,7],[38,8,38,9],[38,10,38,17],[38,18,38,25],[40,0,40,1],[40,2,40,3],[41,0,41,1],[41,2,41,3],[42,0,42,1],[42,2,42,3],[43,0,43,1],[43,2,43,3],[43,10,43,25],[44,0,44,1],[44,2,44,3],[44,10,44,25]]}
[{"$f":"DATE('1'!AA18,'1'!AA20+2,1)","v":"2022-10-01"},{"$nulls":9},{"$f":"DATE(YEAR(A1),MONTH(A1)-1,1)","v":"2022-09-01"},{"$nulls":7},{"$f":"DATE(YEAR(A1),MONTH(A1)+1,1)","v":"2022-11-01"}]
[{"$nulls":10},{"$f":"INDEX({\"S\";\"M\";\"T\";\"W\";\"T\";\"F\";\"S\"},1+MOD(start_day+1-2,7))","v":"S"},{"$f":"INDEX({\"S\";\"M\";\"T\";\"W\";\"T\";\"F\";\"S\"},1+MOD(start_day+2-2,7))","v":"M"},{"$f":"INDEX({\"S\";\"M\";\"T\";\"W\";\"T\";\"F\";\"S\"},1+MOD(start_day+3-2,7))","v":"T"},{"$f":"INDEX({\"S\";\"M\";\"T\";\"W\";\"T\";\"F\";\"S\"},1+MOD(start_day+4-2,7))","v":"W"},{"$f":"INDEX({\"S\";\"M\";\"T\";\"W\";\"T\";\"F\";\"S\"},1+MOD(start_day+5-2,7))","v":"T"},{"$f":"INDEX({\"S\";\"M\";\"T\";\"W\";\"T\";\"F\";\"S\"},1+MOD(start_day+6-2,7))","v":"F"},{"$f":"INDEX({\"S\";\"M\";\"T\";\"W\";\"T\";\"F\";\"S\"},1+MOD(start_day+7-2,7))","v":"S"},null,{"$f":"INDEX({\"S\";\"M\";\"T\";\"W\";\"T\";\"F\";\"S\"},1+MOD(start_day+1-2,7))","v":"S"},{"$f":"INDEX({\"S\";\"M\";\"T\";\"W\";\"T\";\"F\";\"S\"},1+MOD(start_day+2-2,7))","v":"M"},{"$f":"INDEX({\"S\";\"M\";\"T\";\"W\";\"T\";\"F\";\"S\"},1+MOD(start_day+3-2,7))","v":"T"},{"$f":"INDEX({\"S\";\"M\";\"T\";\"W\";\"T\";\"F\";\"S\"},1+MOD(start_day+4-2,7))","v":"W"},{"$f":"INDEX({\"S\";\"M\";\"T\";\"W\";\"T\";\"F\";\"S\"},1+MOD(start_day+5-2,7))","v":"T"},{"$f":"INDEX({\"S\";\"M\";\"T\";\"W\";\"T\";\"F\";\"S\"},1+MOD(start_day+6-2,7))","v":"F"},{"$f":"INDEX({\"S\";\"M\";\"T\";\"W\";\"T\";\"F\";\"S\"},1+MOD(start_day+7-2,7))","v":"S"}]
[{"$nulls":10},{"$f":"IF(MONTH($K$1)<>MONTH($K$1-(WEEKDAY($K$1,1)-(start_day-1))-IF((WEEKDAY($K$1,1)-(start_day-1))<=0,7,0)+(ROW(K3)-ROW($K$3))*7+(COLUMN(K3)-COLUMN($K$3)+1)),\"\",$K$1-(WEEKDAY($K$1,1)-(start_day-1))-IF((WEEKDAY($K$1,1)-(start_day-1))<=0,7,0)+(ROW(K3)-ROW($K$3))*7+(COLUMN(K3)-COLUMN($K$3)+1))","v":"2022-09-11"},"2022-09-12","2022-09-13","2022-09-14","2022-09-15","2022-09-16","2022-09-17",null,{"$f":"IF(MONTH($S$1)<>MONTH($S$1-(WEEKDAY($S$1,1)-(start_day-1))-IF((WEEKDAY($S$1,1)-(start_day-1))<=0,7,0)+(ROW(S3)-ROW($S$3))*7+(COLUMN(S3)-COLUMN($S$3)+1)),\"\",$S$1-(WEEKDAY($S$1,1)-(start_day-1))-IF((WEEKDAY($S$1,1)-(start_day-1))<=0,7,0)+(ROW(S3)-ROW($S$3))*7+(COLUMN(S3)-COLUMN($S$3)+1))","v":"2022-11-13"},"2022-11-14","2022-11-15","2022-11-16","2022-11-17","2022-11-18","2022-11-19"]
[{"$nulls":10},"2022-09-18","2022-09-19","2022-09-20","2022-09-21","2022-09-22","2022-09-23","2022-09-24",null,"2022-11-20","2022-11-21","2022-11-22","2022-11-23","2022-11-24","2022-11-25","2022-11-26"]
[{"$nulls":10},"2022-09-25","2022-09-26","2022-09-27","2022-09-28","2022-09-29","2022-09-30","",null,"2022-11-27","2022-11-28","2022-11-29","2022-11-30","","",""]
[{"$nulls":10},"","","","","","","",null,"","","","","","",""]
[{"$nulls":10},"","","","","","","",null,"","","","","","",""]
[{"$nulls":10},"","","","","","","",null,"","","","","","",""]
["SUNDAY",null,"MONDAY",null,"TUESDAY",null,"WEDNESDAY",null,"THURSDAY",null,"FRIDAY",{"$nulls":7},"SATURDAY"]
[{"$nulls":18},{"$f":"DAY(1)","v":"1900-01-01"}]
[]
[]
[]
[]
[]
[{"$f":"S10+1","v":"1900-01-02"},null,{"$f":"A16+1","v":"1900-01-03"},null,{"$f":"C16+1","v":"1900-01-04"},null,{"$f":"E16+1","v":"1900-01-05"},null,{"$f":"G16+1","v":"1900-01-06"},null,{"$f":"I16+1","v":"1900-01-07"},{"$nulls":7},{"$f":"K16+1","v":"1900-01-08"}]
[{"$nulls":18},"XC MEET"]
[null,null,"PRACTICE",null,"PRACTICE",null,"PRACTICE",null,"PRACTICE",null,"NO PRACTICE",{"$nulls":7},"GIRLS : 8:30 AM"]
[{"$nulls":18},"BOYS: 9:00 AM"]
[null,null,"3:50 - 5:00 PM",null,"3:50 - 5:00 PM",null,"3:50 - 5:00 PM",null,"3:50 - 5:00 PM"]
[]
[{"$f":"S16+1","v":"1900-01-09"},null,{"$f":"A22+1","v":"1900-01-10"},null,{"$f":"C22+1","v":"1900-01-11"},null,{"$f":"E22+1","v":"1900-01-12"},null,{"$f":"G22+1","v":"1900-01-13"},null,{"$f":"I22+1","v":"1900-01-14"},{"$nulls":7},{"$f":"K22+1","v":"1900-01-15"}]
[null,null,"PRACTICE",null,"PRACTICE",null,"PRACTICE",null,"PRACTICE",{"$nulls":9},"XC MEET"]
[{"$nulls":10},"NO PRACTICE",{"$nulls":7},"GIRLS: 8:30 AM"]
[null,null,"3:50 - 5:00 PM",null,"3:50 - 5:00 PM",null,"3:50 - 5:00 PM",null,"3:50 - 5:00 PM",{"$nulls":9},"BOYS: 9:00 AM"]
[]
[]
[{"$f":"S22+1","v":"1900-01-16"},null,{"$f":"A28+1","v":"1900-01-17"},null,{"$f":"C28+1","v":"1900-01-18"},null,{"$f":"E28+1","v":"1900-01-19"},null,{"$f":"G28+1","v":"1900-01-20"},null,{"$f":"I28+1","v":"1900-01-21"},{"$nulls":7},{"$f":"K28+1","v":"1900-01-22"}]
[null,null,"PRACTICE",null,"PRACTICE",null,"PRACTICE",null,"PRACTICE",{"$nulls":9},"XC MEET"]
[{"$nulls":10},"NO PRACTICE",{"$nulls":7},"GIRLS: 8:30 AM"]
[null,null,"3:50 - 5:00 PM",null,"3:50 - 5:00 PM",null,"3:50 - 5:00 PM",null,"3:50 - 5:00 PM",{"$nulls":9},"BOYS: 9:00 AM"]
[]
[]
[{"$f":"S28+1","v":"1900-01-23"},null,{"$f":"A34+1","v":"1900-01-24"},null,{"$f":"C34+1","v":"1900-01-25"},null,{"$f":"E34+1","v":"1900-01-26"},null,{"$f":"G34+1","v":"1900-01-27"},null,{"$f":"I34+1","v":"1900-01-28"},{"$nulls":7},{"$f":"K34+1","v":"1900-01-29"}]
[null,null,"PRACTICE",null,"** MORNING PRACTICE",null,"PRACTICE",null,"PRACTICE",{"$nulls":9},"XC MEET"]
[{"$nulls":10},"NO PRACTICE",{"$nulls":7},"GIRLS: 8:30 AM"]
[null,null,"3:50 - 5:00 PM",null,"7:00:00 AM - 8:00 AM",null,"3:50 - 5:00 PM",null,"3:50 - 5:00 PM",{"$nulls":9},"BOYS: 9:00 AM"]
[]
[]
[{"$f":"S34+1","v":"1900-01-30"},null,{"$f":"A40+1","v":"1900-01-31"},null,"Notes"]
[]
[]
[]
[{"$nulls":10},"Calendar Templates by Vertex42"]
[{"$nulls":10},"https://www.vertex42.com/calendars/"]